{"text_format":"1","workbook":"xlsx","n_sheets":5,"sheets":["Aktuální TABULKA","HRÁČ týdne a měsíce","SILVESTR. fotbal","Celkové HISTORICKÉ pořadí","Aktuální TABULKA (2)"],"not_rendered":{"charts":0,"images":0,"macros":1,"external_links":0,"defined_names":2,"comments":0,"pivot_tables":0},"unopened":[],"bounds":{"document_bytes":16777216,"sheet_cells":100000,"rows_first":2000,"rows_last":500,"rows_between":2000,"halvings":0,"cell_chars":16384,"cell_head_chars":4096},"cells_cut":0,"cells_raw":0,"read":"whole","date_system":"1900"}

{"sheet":"Aktuální TABULKA","index":0,"n_rows":38,"n_cols":46,"rows_kept":38,"cut":false,"hidden":false,"merged":[[1,1,2,2],[31,1,31,2]]}
[" ","Pravá FC Klička","kolo:",1,{"$f":"D1+1","v":2},{"$f":"E1+1","v":3},4,5,6,7,8,9,10,11,12,13,14,15,16,17,18,{"$f":"U1+1","v":19},{"$f":"V1+1","v":20},{"$f":"W1+1","v":21},{"$f":"X1+1","v":22},{"$f":"Y1+1","v":23},{"$f":"Z1+1","v":24},{"$f":"AA1+1","v":25},{"$f":"AB1+1","v":26},{"$f":"AC1+1","v":27},28,29,30,31]
[null,"ZIMA2021\n2022",null,{"$f":"IF(WEEKDAY(D3,2)=1,\"Po\",IF(WEEKDAY(D3,2)=2,\"Út\",IF(WEEKDAY(D3,2)=3,\"St\",IF(WEEKDAY(D3,2)=4,\"Čt\",IF(WEEKDAY(D3,2)=5,\"Pá\",IF(WEEKDAY(D3,2)=6,\"So\",\"NE\"))))))","v":"Po"},{"$f":"IF(WEEKDAY(E3,2)=1,\"Po\",IF(WEEKDAY(E3,2)=2,\"Út\",IF(WEEKDAY(E3,2)=3,\"St\",IF(WEEKDAY(E3,2)=4,\"Čt\",IF(WEEKDAY(E3,2)=5,\"Pá\",IF(WEEKDAY(E3,2)=6,\"So\",\"NE\"))))))","v":"Po"},"Po","Po","Po","Po","Po","Po","Po","Po","Po","Po","Po","Út","Po","Po","Po","Po","Po","Po","Po","Po","Po","Po","Po","Po","Po","Po","Po","Po","Po"," ","hráno","nehráno",null," "]
[null,null,null,"2021-10-04","2021-10-11","2021-10-18","2021-10-25","2021-11-01","2021-11-08","2021-11-15","2021-11-22","2021-11-29","2021-12-06","2021-12-13","2021-12-20","2021-12-27","31.12.","2022-01-03","2022-01-10","2022-01-17","2022-01-24","2022-01-31","2022-02-07","2022-02-14","2022-02-21","2022-02-28","2022-03-07","2022-03-14","2022-03-21","2022-03-28","2022-04-04","2022-04-11","2022-04-18","2022-04-25"," ",{"$f":"COUNTA(D5:AH5)","v":25},3]
[]
[null,null,"platba","14:5","9:6","16:7","10:7","8:5","5:4","2:0","13:8","13:6","13:5","10:2","10:4","14:11","22:17","6:5","4:3","10:9","11:7",null,"13:6","7:2","4:1",null,"12:6","6:4","5:4",null,"7:5",null,null,null,"BODY","minulé pořadí","POŘADÍ","Vývoj","HRÁČ","účasti","výhry","remízy","prohry","skóre","docházka","úspěšnost"]
[{"$f":"AK6","v":1},"Pája",1000,null,3,3,1,1,3,3,1,3,1,1,3,1,1,1,3,1,1,null,3,3,1,null,3,3,1,null,3,null,null,null,{"$f":"SUM(D6:AH6)","v":48},2,1,{"$f":"AJ6-AK6","v":1},{"$f":"B6","v":"Pája"},{"$f":"COUNT(D6:AH6)","v":24},12,0,12,6,{"$f":"+AN6/$AJ$3","v":0.96},{"$f":"IF(AS6<0.5, \"n.a.\",(AO6+AP6/2)/AN6)","v":0.5}]
[{"$f":"AK7","v":2},"Láďa S.",1000,3,null,3,3,3,3,1,3,3,3,1,1,null,3,1,null,1,3,null,null,3,null,null,3,1,3,null,3,null,null,null,{"$f":"SUM(D7:AH7)","v":48},3,2,{"$f":"AJ7-AK7","v":1},{"$f":"B7","v":"Láďa S."},{"$f":"COUNT(D7:AH7)","v":20},14,0,6,48,{"$f":"+AN7/$AJ$3","v":0.8},{"$f":"IF(AS7<0.5, \"n.a.\",(AO7+AP7/2)/AN7)","v":0.7}]
[{"$f":"AK8","v":3},"Rosťa",1000,3,1,3,null,3,1,2,3,3,1,3,3,null,null,3,1,3,1,null,1,1,3,null,1,3,3,null,1,null,null,null,{"$f":"SUM(D8:AH8)","v":47},1,3,{"$f":"AJ8-AK8","v":-2},{"$f":"B8","v":"Rosťa"},{"$f":"COUNT(D8:AH8)","v":22},12,0,9,18,{"$f":"+AN8/$AJ$3","v":0.88},{"$f":"IF(AS8<0.5, \"n.a.\",(AO8+AP8/2)/AN8)","v":0.54545454545454541}]
[{"$f":"AK9","v":4},"Kristalex",1000,1,null,1,1,3,null,3,null,3,null,3,3,3,null,1,3,1,3,null,3,3,3,null,null,1,1,null,3,null,null,null,{"$f":"SUM(D9:AH9)","v":43},4,4,{"$f":"AJ9-AK9","v":0},{"$f":"B9","v":"Kristalex"},{"$f":"COUNT(D9:AH9)","v":19},12,0,7,25,{"$f":"+AN9/$AJ$3","v":0.76},{"$f":"IF(AS9<0.5, \"n.a.\",(AO9+AP9/2)/AN9)","v":0.63157894736842102}]
[{"$f":"AK10","v":5},"Marek",1000,1,3,3,3,null,1,2,null,null,null,3,3,1,null,3,3,1,null,null,3,1,3,null,1,3,1,null,1,null,null,null,{"$f":"SUM(D10:AH10)","v":40},5,5,{"$f":"AJ10-AK10","v":0},{"$f":"B10","v":"Marek"},{"$f":"COUNT(D10:AH10)","v":19},10,0,8,15,{"$f":"+AN10/$AJ$3","v":0.76},{"$f":"IF(AS10<0.5, \"n.a.\",(AO10+AP10/2)/AN10)","v":0.52631578947368418}]
[{"$f":"AK11","v":6},"Čuďa",1000,1,1,3,3,1,1,2,1,1,null,3,3,null,null,null,null,3,1,null,1,1,null,null,3,3,3,null,3,null,null,null,{"$f":"SUM(D11:AH11)","v":38},7,6,{"$f":"AJ11-AK11","v":1},{"$f":"B11","v":"Čuďa"},{"$f":"COUNT(D11:AH11)","v":19},9,0,9,-6,{"$f":"+AN11/$AJ$3","v":0.76},{"$f":"IF(AS11<0.5, \"n.a.\",(AO11+AP11/2)/AN11)","v":0.47368421052631576}]
[{"$f":"AK12","v":7},"Eman",null,null,null,null,1,3,3,1,3,1,3,3,1,null,null,1,3,3,3,null,null,3,null,null,3,1,null,null,1,null,null,null,{"$f":"SUM(D12:AH12)","v":37},6,7,{"$f":"AJ12-AK12","v":-1},{"$f":"B12","v":"Eman"},{"$f":"COUNT(D12:AH12)","v":17},10,0,7,19,{"$f":"+AN12/$AJ$3","v":0.68},{"$f":"IF(AS12<0.5, \"n.a.\",(AO12+AP12/2)/AN12)","v":0.58823529411764708}]
[{"$f":"AK13","v":8},"Michal",null,null,null,null,null,3,null,3,3,1,3,1,1,null,null,3,1,null,1,null,1,null,3,null,1,3,null,null,null,null,null,null,{"$f":"SUM(D13:AH13)","v":28},8,8,{"$f":"AJ13-AK13","v":0},{"$f":"B13","v":"Michal"},{"$f":"COUNT(D13:AH13)","v":14},7,0,7,-15,{"$f":"+AN13/$AJ$3","v":0.56000000000000005},{"$f":"IF(AS13<0.5, \"n.a.\",(AO13+AP13/2)/AN13)","v":0.5}]
[{"$f":"AK14","v":9},"Honza",1000,3,3,1,1,null,null,null,null,null,null,3,3,null,1,3,null,3,3,null,null,null,null,null,null,null,null,null,null,null,null,null,{"$f":"SUM(D14:AH14)","v":24},9,9,{"$f":"AJ14-AK14","v":0},{"$f":"B14","v":"Honza"},{"$f":"COUNT(D14:AH14)","v":10},7,0,3,15,{"$f":"+AN14/$AJ$3","v":0.4},{"$f":"IF(AS14<0.5, \"n.a.\",(AO14+AP14/2)/AN14)","v":"n.a."}]
[{"$f":"AK15","v":10},"Venca",1000,3,null,null,1,1,3,3,null,null,null,null,null,1,1,null,1,null,null,null,null,3,1,null,1,1,1,null,1,null,null,null,{"$f":"SUM(D15:AH15)","v":22},10,10,{"$f":"AJ15-AK15","v":0},{"$f":"B15","v":"Venca"},{"$f":"COUNT(D15:AH15)","v":14},4,0,10,-12,{"$f":"+AN15/$AJ$3","v":0.56000000000000005},{"$f":"IF(AS15<0.5, \"n.a.\",(AO15+AP15/2)/AN15)","v":0.2857142857142857}]
[{"$f":"AK16","v":11},"Arpi",1000,null,3,null,null,null,1,null,null,1,null,null,1,3,null,1,3,null,3,null,3,1,null,null,null,null,null,null,null,null,null,null,{"$f":"SUM(D16:AH16)","v":20},11,11,{"$f":"AJ16-AK16","v":0},{"$f":"B16","v":"Arpi"},{"$f":"COUNT(D16:AH16)","v":10},5,0,5,-2,{"$f":"+AN16/$AJ$3","v":0.4},{"$f":"IF(AS16<0.5, \"n.a.\",(AO16+AP16/2)/AN16)","v":"n.a."}]
[{"$f":"AK17","v":12},"Tomáš",null,null,null,null,null,1,null,1,1,null,null,1,1,null,1,null,null,1,null,null,3,null,1,null,3,1,1,null,3,null,null,null,{"$f":"SUM(D17:AH17)","v":19},14,12,{"$f":"AJ17-AK17","v":2},{"$f":"B17","v":"Tomáš"},{"$f":"COUNT(D17:AH17)","v":13},3,0,10,-21,{"$f":"+AN17/$AJ$3","v":0.52},{"$f":"IF(AS17<0.5, \"n.a.\",(AO17+AP17/2)/AN17)","v":0.23076923076923078}]
[{"$f":"AK18","v":13},"Melis",null,3,1,1,null,1,3,3,3,1,1,1,1,null,null,null,null,null,null,null,null,null,null,null,null,null,null,null,null,null,null,null,{"$f":"SUM(D18:AH18)","v":19},12,13,{"$f":"AJ18-AK18","v":-1},{"$f":"B18","v":"Melis"},{"$f":"COUNT(D18:AH18)","v":11},4,0,7,-27,{"$f":"+AN18/$AJ$3","v":0.44},{"$f":"IF(AS18<0.5, \"n.a.\",(AO18+AP18/2)/AN18)","v":"n.a."}]
[{"$f":"AK19","v":14},"Aleš",null,null,null,null,null,null,null,null,null,null,null,1,1,null,3,1,1,3,1,null,1,null,3,null,null,null,3,null,null,null,null,null,{"$f":"SUM(D19:AH19)","v":18},13,14,{"$f":"AJ19-AK19","v":-1},{"$f":"B19","v":"Aleš"},{"$f":"COUNT(D19:AH19)","v":10},4,0,6,-17,{"$f":"+AN19/$AJ$3","v":0.4},{"$f":"IF(AS19<0.5, \"n.a.\",(AO19+AP19/2)/AN19)","v":"n.a."}]
[{"$f":"AK20","v":15},"Daniel",null,1,null,null,null,null,null,null,null,null,null,null,1,3,null,3,null,3,null,null,null,null,null,null,1,1,3,null,1,null,null,null,{"$f":"SUM(D20:AH20)","v":17},15,15,{"$f":"AJ20-AK20","v":0},{"$f":"B20","v":"Daniel"},{"$f":"COUNT(D20:AH20)","v":9},4,0,5,-19,{"$f":"+AN20/$AJ$3","v":0.36},{"$f":"IF(AS20<0.5, \"n.a.\",(AO20+AP20/2)/AN20)","v":"n.a."}]
[{"$f":"AK21","v":16},"Karel",1000,null,null,null,null,null,1,2,1,3,null,3,3,null,null,3,null,null,null,null,null,null,null,null,null,null,null,null,null,null,null,null,{"$f":"SUM(D21:AH21)","v":16},16,16,{"$f":"AJ21-AK21","v":0},{"$f":"B21","v":"Karel"},{"$f":"COUNT(D21:AH21)","v":7},4,0,2,16,{"$f":"+AN21/$AJ$3","v":0.28000000000000003},{"$f":"IF(AS21<0.5, \"n.a.\",(AO21+AP21/2)/AN21)","v":"n.a."}]
[{"$f":"AK22","v":17},"Exi",null,null,3,1,3,null,1,1,1,null,null,null,3,null,null,null,null,null,null,null,null,null,null,null,null,null,null,null,null,null,null,null,{"$f":"SUM(D22:AH22)","v":13},17,17,{"$f":"AJ22-AK22","v":0},{"$f":"B22","v":"Exi"},{"$f":"COUNT(D22:AH22)","v":7},3,0,4,-5,{"$f":"+AN22/$AJ$3","v":0.28000000000000003},{"$f":"IF(AS22<0.5, \"n.a.\",(AO22+AP22/2)/AN22)","v":"n.a."}]
[{"$f":"AK23","v":18},"Posoldič",null,null,1,1,3,null,null,2,1,null,null,null,null,null,null,null,null,null,null,null,null,null,null,null,null,null,null,null,null,null,null,null,{"$f":"SUM(D23:AH23)","v":8},18,18,{"$f":"AJ23-AK23","v":0},{"$f":"B23","v":"Posoldič"},{"$f":"COUNT(D23:AH23)","v":5},1,0,3,-14,{"$f":"+AN23/$AJ$3","v":0.2},{"$f":"IF(AS23<0.5, \"n.a.\",(AO23+AP23/2)/AN23)","v":"n.a."}]
[{"$f":"AK24","v":19},"Milda",null,null,null,null,null,null,null,null,null,null,null,null,null,null,3,null,null,null,null,null,null,null,null,null,null,null,null,null,null,null,null,null,{"$f":"SUM(D24:AH24)","v":3},19,19,{"$f":"AJ24-AK24","v":0},{"$f":"B24","v":"Milda"},{"$f":"COUNT(D24:AH24)","v":1},1,0,0,5,{"$f":"+AN24/$AJ$3","v":0.04},{"$f":"IF(AS24<0.5, \"n.a.\",(AO24+AP24/2)/AN24)","v":"n.a."}]
[{"$f":"AK25","v":20},"Martin",null,null,null,null,null,null,null,null,null,null,null,null,null,null,3,null,null,null,null,null,null,null,null,null,null,null,null,null,null,null,null,null,{"$f":"SUM(D25:AH25)","v":3},20,20,{"$f":"AJ25-AK25","v":0},{"$f":"B25","v":"Martin"},{"$f":"COUNT(D25:AH25)","v":1},1,0,0,5,{"$f":"+AN25/$AJ$3","v":0.04},{"$f":"IF(AS25<0.5, \"n.a.\",(AO25+AP25/2)/AN25)","v":"n.a."}]
[{"$f":"AK26","v":21},"Jirka",null,null,null,null,null,null,null,null,null,null,null,1,null,null,null,null,null,null,null,null,null,null,1,null,null,null,null,null,null,null,null,null,{"$f":"SUM(D26:AH26)","v":2},21,21,{"$f":"AJ26-AK26","v":0},{"$f":"B26","v":"Jirka"},{"$f":"COUNT(D26:AH26)","v":2},0,0,2,-11,{"$f":"+AN26/$AJ$3","v":0.08},{"$f":"IF(AS26<0.5, \"n.a.\",(AO26+AP26/2)/AN26)","v":"n.a."}]
[{"$f":"AK27","v":22},"Josef",null,null,null,null,null,null,null,null,null,null,null,null,null,null,null,null,null,null,null,null,null,null,null,null,null,null,null,null,null,null,null,null,{"$f":"SUM(D27:AH27)","v":0},22,22,{"$f":"AJ27-AK27","v":0},{"$f":"B27","v":"Josef"},{"$f":"COUNT(D27:AH27)","v":0},0,0,0,0,{"$f":"+AN27/$AJ$3","v":0},{"$f":"IF(AS27<0.5, \"n.a.\",(AO27+AP27/2)/AN27)","v":"n.a."}]
[{"$f":"AK28","v":23},"Bořek",null,null,null,null,null,null,null,null,null,null,null,null,null,null,null,null,null,null,null,null,null,null,null,null,null,null,null,null,null,null,null,null,{"$f":"SUM(D28:AH28)","v":0},23,23,{"$f":"AJ28-AK28","v":0},{"$f":"B28","v":"Bořek"},{"$f":"COUNT(D28:AH28)","v":0},0,0,0,0,{"$f":"+AN28/$AJ$3","v":0},{"$f":"IF(AS28<0.5, \"n.a.\",(AO28+AP28/2)/AN28)","v":"n.a."}]
[{"$f":"AK29","v":24},"Pepa",null,null,null,null,null,null,null,null,null,null,null,null,null,null,null,null,null,null,null,null,null,null,null,null,null,null,null,null,null,null,null,null,{"$f":"SUM(D29:AH29)","v":0},24,24,{"$f":"AJ29-AK29","v":0},{"$f":"B29","v":"Pepa"},{"$f":"COUNT(D29:AH29)","v":0},0,0,0,0,{"$f":"+AN29/$AJ$3","v":0},{"$f":"IF(AS29<0.5, \"n.a.\",(AO29+AP29/2)/AN29)","v":"n.a."}]
[{"$f":"AK30","v":25},"Petr",null,null,null,null,null,null,null,null,null,null,null,null,null,null,null,null,null,null,null,null,null,null,null,null,null,null,null,null,null,null,null,null,{"$f":"SUM(D30:AH30)","v":0},25,25,{"$f":"AJ30-AK30","v":0},{"$f":"B30","v":"Petr"},{"$f":"COUNT(D30:AH30)","v":0},0,0,0,0,{"$f":"+AN30/$AJ$3","v":0},{"$f":"IF(AS30<0.5, \"n.a.\",(AO30+AP30/2)/AN30)","v":"n.a."}]
[null,null,null,null,null,null,null,null,null,null,null,null,null,null,null,null,null,null,null,null,null,null,null,null,null,null,null,null,null,null,null,null,null,null,null,26,26]
[null,"počet hráčů:",null,{"$f":"IF(COUNT(D6:D29) = 0, \"n/a\", COUNT(D6:D29))","v":9},9,10,10,10,11,14,11,10,6,14,16,6,8,{"$f":"IF(COUNT(R6:R30) = 0, \"n/a\", COUNT(R6:R30))","v":12},{"$f":"IF(COUNT(S6:S30) = 0, \"n/a\", COUNT(S6:S30))","v":9},11,10,"n/a",9,9,9,"n/a",10,11,10,"n/a",10,"n/a","n/a","n/a",{"$f":"AVERAGE(D32:AH32)","v":10.16},null,null,null,null,null,0,0,0,0]
[]
[null,"výhra",3,null,null,null,"volí",null,null,null,null,"volí",null,null,null,"volí",null,null,"P",null,null,"volí",null,null,null,"volí",null,null,null,"volí",null,null,null,null," - při rovnosti bodů rozhoduje o pořadí vyšší počet účastí, potom skóre, úspěšnost, los "]
[null,"remíza","-",null,null,null,"poslední",null,null,null,null,"poslední",null,null,null,"poslední",null,null,null,null,null,"poslední",null,null,null,"poslední",null,null,null,"poslední",null,null,null,null," - procento úspěšnosti (M.V.P.) se počítá pouze u hráčů s minimálně 50% docházkou a o pořadí rozhodují % na desetinná místa"]
[null,"prohra",1,null,null,null,"dva z 10",null,null,null,null,"dva z 10",null,null,null,"dva z 10",null,null,null,null,null,"dva z 10",null,null,null,"dva z 10",null,null,null,"dva z 10",null,null,null,null," - v posledním \"double\" kole se všechny položky počítají dvojnásobně; rozdělení sudá / lichá"]
[null,"neúčast",0," ",null,null,null,null,null,null,null,null,null,null,null,null,null,null,null,null,null,null,null,null,null,null,null,null,null,null,null,null,null,null," - v prvních kolech sezóny se při shodném počtu bodů určuje pořadí podle poslední sezóny téhož období"]
[null,null,null,null,null,null,null,null,null,null,null,null,null,null,null,null,null,null,null,null,null,null,null,null,null,null,null,null,null,null,null,null,null,null," - při remíze se kopou penalty"]

{"sheet":"HRÁČ týdne a měsíce","index":1,"n_rows":33,"n_cols":12,"rows_kept":33,"cut":false,"hidden":false,"merged":[[11,4,15,4],[11,5,15,5],[25,4,28,4],[25,5,28,5],[29,4,32,4],[29,5,32,5],[21,4,24,4],[21,5,24,5],[16,5,20,5],[16,4,20,4],[1,6,1,7],[2,5,5,5],[1,4,1,5],[6,5,10,5],[2,4,5,4],[6,4,10,4]]}
[]
[null,"týden","kolo","hráč týdne","hráč měsíce",null,"statistiky"]
[null,"40.","1.","Láďa S.","říjen","Marek","hráno:",4,null,null,"Láďa S.",3]
[null,"41.","2.","Honza",null,null,"nehráno:",0,null,null,"Aleš",3]
[null,"42.","3.","Marek",null,null,"bodů:",10,null,null,"Honza",2]
[null,"43.","4.","Posoldič",null,null,null,null,null,null,"Michal",2]
[null,"44.","5.","Michal","listopad","Láďa","hráno:",5,null,null,"Eman",2]
[null,"45.","6.","Eman",null,null,"nehráno:",0,null,null,"Kristalex",2]
[null,"46.","7.","Kristalex",null,null,"bodů:",13,null,null,"Rosťa",2]
[null,"47.","8.","Rosťa",null,null,null,null,null,null,"Tomáš",2]
[null,"48.","9.","Karel",null,null,null,null,null,null,"Pája",2]
[null,"49.","10.","Eman","prosinec","Kristalex","hráno:",5,null,null,"Marek",1]
[null,"50.","11.","Rosťa",null,null,"nehráno:",0,null,null,"Posoldič",1]
[null,"51.","12.","Honza",null,null,"bodů:",9,null,null,"Karel",1]
[null,"52.","13.","Kristalex",null,null,null,null,null,null,"Venca",1]
[null,"52.","14.","Tomáš",null,null,null,null,null,null,"Čuďa",1]
[null,"1.","15.","Michal","leden","Eman","hráno:",4]
[null,"2.","16.","Venca",null,null,"nehráno:",1]
[null,"3.","17.","Aleš",null,null,"bodů:",10]
[null,"4.","18.","Pája"]
[null,"5.","19."," ---"]
[null,"6.","20.","Tomáš","únor","Kristalex","hráno:",3]
[null,"7.","21.","Láďa S.",null,null,"nehráno:",1]
[null,"8.","22.","Aleš",null,null,"bodů:",9]
[null,"9.","23."]
[null,"10.","24.","Láďa S.","březen","Čuďa","hráno:",3]
[null,"11.","25.","Pája",null,null,"nehráno:",1]
[null,"12.","26.","Aleš",null,null,"bodů:",9]
[null,"13.","27."]
[null,"14.","28.","Čuďa","duben",null,"hráno:"]
[null,"15.","29.",null,null,null,"nehráno:"]
[null,"16.","30.",null,null,null,"bodů:"]
[null,"17.","31."]

{"sheet":"SILVESTR. fotbal","index":2,"n_rows":35,"n_cols":22,"rows_kept":35,"cut":false,"hidden":false,"merged":[[34,1,34,2]]}
[]
[null,null,null,"Polabiny","Trnová","Ohrazenice","Trnová","Stéblová","Nemošice","Stéblová","Stéblová","COVID-19","Stéblová",null," "]
[null,null,null,"31.12.","31.12.","31.12.","31.12.","31.12.","31.12","31.12.","31.12.","31.12.","31.12.","hráno",9]
[null,null,null,2012,2013,2014,2015,2016,2017,2018,2019,2020,2021,"9x"]
[null,"POŘADÍ",null,"+1","+3","+6","0","+11","+13","+5","+1","X","+5","ÚČASTI","BODY","výhry",null,"remíz","prohry","SKÓRE","docházka","ÚSPĚŠNOST"]
[null,"1.","Pája",3,1,1,2,1,3,3,3,"COVID-19",1,{"$f":"COUNT(D6:M6)","v":9},{"$f":"SUM(D6:M6)","v":18},4,4.5,1,4,"-5",{"$f":"N6/$O$3","v":1},{"$f":"Q6/N6","v":0.5}]
[null,"2.","Námořník",3,1,3,null,3,3,null,null,null,null,5,13,4,4,0,1,"28",{"$f":"N7/$O$3","v":0.55555555555555558},{"$f":"Q7/N7","v":0.8}]
[null,"3.","Dan",1,3,3,2,1,3,null,null,null,null,6,13,3,3.5,1,2,"10",0.66666666666666663,0.58333333333333337]
[null,"4.","Marcel",null,3,3,2,3,1,null,null,null,null,5,12,3,3.5,1,1,"7",0.55555555555555558,0.7]
[null,"5.","Míla",1,3,1,2,3,1,null,null,null,null,6,11,2,2.5,1,3,"-9",0.66666666666666663,0.41666666666666669]
[null,"6.","Nowwas",null,1,3,2,3,1,null,null,null,null,5,10,2,2.5,1,2,"1",0.55555555555555558,0.5]
[null,"7.","Hošan",null,null,1,2,3,3,null,null,null,null,4,9,2,2.5,1,1,"18",0.44444444444444442,0.625]
[null,"8.","Karel",1,3,1,2,1,1,null,null,null,null,6,9,1,1.5,1,4,"-28",0.66666666666666663,0.25]
[null,"9.","Martin Ko.",3,1,1,2,1,1,null,null,null,null,6,9,1,1.5,1,4,"-32",0.66666666666666663,0.25]
[null,10,"Kristalex",null,null,1,2,1,3,1,1,null,null,6,9,1,1.5,1,4,"-10",0.66666666666666663,0.25]
[null,"11.","Jirka",null,null,null,null,null,null,3,3,null,null,2,6,2,2,0,0,"6",0.22222222222222221,"n.a."]
[null,"12.","Milhaus",null,null,null,null,null,null,3,null,null,3,2,6,2,1,0,0,"10",0.22222222222222221,"n.a."]
[null,13,"Láďa S.",null,null,null,null,null,null,null,3,null,3,2,6,2,1,0,0,"6",0.22222222222222221,"n.a."]
[null,"14.","Aleš",null,null,null,null,null,null,null,3,null,3,2,6,2,1,0,0,"6",0.22222222222222221,"n.a."]
[null,"15.","Jozef",null,null,3,2,null,null,null,null,null,null,2,5,1,1.5,1,0,"6",0.22222222222222221,"n.a."]
[null,"16.","Venca",null,null,null,null,null,null,1,3,null,1,3,5,1,1,0,2,"-9",0.33333333333333331,"n.a."]
[null,"17.","Petr S.",null,null,3,null,null,null,1,null,null,null,2,4,1,1,0,1,"1",0.22222222222222221,"n.a."]
[null,"18.","Daniel",null,null,null,null,null,null,3,1,null,null,2,4,1,1,0,1,"4",0.22222222222222221,"n.a."]
[null,"19.","Marek",null,null,null,null,null,null,1,3,null,null,2,4,1,1,0,1,"-4",0.22222222222222221,"n.a."]
[null,"20.","Černoch",null,null,null,null,null,3,null,null,null,null,1,3,1,1,0,0,"13",0.1111111111111111,"n.a."]
[null,"21.","Dočkil",3,null,null,null,null,null,null,null,null,null,1,3,1,1,0,0,"1",0.1111111111111111,"n.a."]
[null,"22.","Martin",null,null,null,null,null,null,null,null,null,3,1,3,1,0,0,0,"5",0.1111111111111111,"n.a."]
[null,"23.","Honza",null,null,null,null,null,null,null,1,null,1,2,2,0,0,0,2,"-6",0.22222222222222221,"n.a."]
[null,"24.","Červ",1,null,null,null,null,null,null,null,null,null,1,1,0,0,0,1,"1",0.1111111111111111,"n.a."]
[null,"25.","Rosťa",null,null,null,null,null,1,null,null,null,null,1,1,0,0,0,1,"1",0.1111111111111111,"n.a."]
[null,"26.","Čuďa",null,null,null,null,null,null,null,1,null,null,1,1,0,0,0,1,"-1",0.1111111111111111,"n.a."]
[null,"27.","Ondra",null,null,null,null,null,null,null,1,null,null,1,1,0,0,0,1,"-1",0.1111111111111111,"n.a."]
[null,"28.","Broňa",null,null,null,null,null,null,null,1,null,null,1,1,0,0,0,1,"-1",0.1111111111111111,"n.a."]
[null,"29.","Tomáš",null,null,null,null,null,null,null,null,null,1,1,1,0,0,0,1,"-5",0.1111111111111111,"n.a."]
[null,"počet hráčů",null,{"$f":"SUM(D6:D32)/2","v":8},8,12,10,10,12,8,11.5,"COVID-19",{"$f":"SUM(M6:M34)/2","v":8}]

{"sheet":"Celkové HISTORICKÉ pořadí","index":3,"n_rows":62,"n_cols":43,"rows_kept":62,"cut":false,"hidden":false,"merged":[[0,1,1,20],[3,25,49,25],[3,28,3,29],[3,31,3,32],[3,34,3,35],[27,28,27,29],[27,31,27,32],[27,34,27,35],[3,40,3,41],[15,28,15,29],[15,31,15,32],[15,34,15,35],[15,37,15,38],[15,40,15,41],[3,37,3,38],[51,28,51,29],[51,31,51,32],[51,34,51,35],[52,32,61,32],[27,40,27,41],[39,28,39,29],[39,31,39,32],[39,34,39,35],[39,37,39,38],[39,40,39,41],[27,37,27,38]]}
[null,"Celkové HISTORICKÉ pořadí jediné a pravé původní FC Kličky od 1994"]
[null,null,null,null,null,null,null,null,null,null,null,null,null,null,null,null,null,null,null,null,null,null,null,null,null,null,null,null,null,null,null," "," "]
[null,"pořadí","hráč","celkem b.","L 2010","Z 2010/11","L 2011","Z 2011/12","L 2012","Z 2012/13","L 2013","Z 2013/14","L 2014","Z 2014/15","L 2015","Z 2015/16","L 2016","Z 2016/17","L 2017","Z 2017/18","L 2017","Z 2018/19","L 2019","Z 2019/20","L 2020","Z 2020/21","L 2021"]
[null,"1.","Pája",{"$f":"SUM(E4:AA4)","v":135},null,null,null,8,1,6,2,10,6,9,4,9,6,7,5,9,10,9,7,9,9,"COVID-19",9,null,"LÉTO 2010",null,"b.","LÉTO 2011",null,"b.","LÉTO 2012",null,"b.","LÉTO 2013",null,"b.","LÉTO 2014",null,"b."]
[null,"2.","Dan",119,10,8,8,5,10,2,10,9,8,10,8,8,2,6,7,8,null,null,null,null,null,null,null,null,"1.","Dan",10,"1.","Námořník",10,"1.","Dan",10,"1.","Dan",10,"1.","Marcel",10]
[null,"3.","Kristalex",112,null,null,null,null,null,null,null,null,null,8,10,4,10,8,9,10,9,10,10,10,10,null,4,null,"2.","Marcel",9,"2.","Kytka",9,"2.","Martin Ko",9,"2.","Pepa",9,"2.","Ota",9]
[null,"4.","Míla",105,8,6,7,7,7,8,8,8,4,6,5,10,5,2,4,6,4,null,null,null,null,null,null,null,"3.","Míla",8,"3.","Dan",8,"3.","Kytka",8,"3.","Míla",8,"3.","Dan",8]
[null,"5.","Marcel",73,9,null,null,null,6,null,4,1,10,1,9,2,8,9,null,7,7,null,null,null,null,null,null,null,"4.","Farry",7,"4.","Míla",7,"4.","Míla",7,"4.","Martin Ko",7,"4.","Martin Ko",7]
[null,"6.","Martin Ko.",72,5,null,6,null,9,5,7,2,7,2,3,7,3,5,8,3,null,null,null,null,null,null,null,null,"5.","Kytka",6,"5.","Martin Ko",6,"5.","Marcel",6,"5.","Námořník",6,"5.","Pája",6]
[null,"7.","Kytka",64,6,10,9,10,8,9,5,7,null,null,null,null,null,null,null,null,null,null,null,null,null,null,null,null,"6.","Martin K.",5,"6.","Farry",5,"6.","Vláďa ",5,"6.","Kytka",5,"6.","Námořník",5]
[null,"8.","Námořník",62,1,7,10,6,4,10,6,6,5,4,null,null,null,3,null,null,null,null,null,null,null,null,null,null,"7.","Franta",4,"7.","Jirka",4,"7.","Námořník",4,"7.","Marcel",4,"7.","Míla",4]
[null,"9.","Karel",46,null,5,null,9,null,7,null,5,null,7,null,5,null,4,null,4,null,null,null,null,null,null,null,null,"8.","Dočkil",3,"8.","Vláďa ",3,"8.","Pepa",3,"8.","Ctibor",3,"8.","Pepa",3]
[null,"10.","Rosťa",41,null,null,null,null,null,null,null,null,2,null,7,1,7,1,3,2,null,6,9,3,null,null,null,null,"9.","Olin",2,"9.","Dočkil",2,"9.","Jindra",2,"9.","Pája",2,"9.","Rosťa",2]
[null,"11.","Hošan",40,null,null,null,null,null,null,null,3,null,5,null,3,4,10,2,5,8,null,null,null,null,null,null,null,"10.","Námořník",1,"10.","Honza T.",1,"10.","Pája",1,"10.","Vláďa",1,"10.","Láďa",1]
[null,"12.","Marek",30,null,null,null,null,null,null,null,null,null,null,null,null,null,null,null,null,6,8,null,2,6,null,8]
[null,"13.","Daniel",27,null,null,null,null,null,null,null,null,null,null,null,null,null,null,null,null,3,7,null,6,4,null,7,null,"ZIMA 2010/2011",null,"b.","ZIMA 2011/2012",null,"b.","ZIMA 2012/2013",null,"b.","ZIMA 2013/2014",null,"b.","ZIMA 2014/2015",null,"b."]
[null,"14.","Láďa S.",27,null,null,null,1,null,null,null,null,null,null,null,null,null,null,null,null,null,null,null,8,8,null,10,null,"1.","Kytka",10,"1.","Kytka",10,"1.","Námořník",10,"1.","Pája",10,"1.","Dan",10]
[null,"15.","Farry",21,7,9,5,null,null,null,null,null,null,null,null,null,null,null,null,null,null,null,null,null,null,null,null,null,"2.","Farry",9,"2.","Karel",9,"2.","Kytka",9,"2.","Dan",9,"2.","Pája",9]
[null,"16.","Venca",21,null,null,null,null,null,null,null,null,null,null,null,null,null,null,null,null,5,5,4,7,null,null,null,null,"3.","Dan",8,"3.","Pája",8,"3.","Míla",8,"3.","Míla",8,"3.","Kristalex",8]
[null,"17.","Černoch",16,null,null,null,null,null,null,null,null,null,null,null,null,9,null,6,1,null,null,null,null,null,null,null,null,"4.","Námořník",7,"4.","Míla",7,"4.","Karel",7,"4.","Kytka",7,"4.","Karel",7]
[null,"18.","Ota",16,null,null,null,null,null,null,null,null,9,null,6,null,1,null,null,null,null,null,null,null,null,null,null,null,"5.","Míla",6,"5.","Námořník",6,"5.","Pája",6,"5.","Námořník",6,"5.","Míla",6]
[null,"19.","Jirka",15,null,null,4,null,null,null,null,null,null,null,null,null,null,null,null,null,null,null,6,5,null,null,null,null,"6.","Karel",5,"6.","Dan",5,"6.","Martin Ko",5,"6.","Karel",5,"6.","Hošan",5]
[null,"20.","Pepa",15,null,null,null,null,3,null,9,null,3,null,null,null,null,null,null,null,null,null,null,null,null,null,null,null,"7.","Jarda",4,"7.","Jindra",4,"7.","Jindra",4,"7.","Červ",4,"7.","Námořník",4]
[null,"21.","Aleš",14,null,null,null,null,null,null,null,null,null,null,null,null,null,null,null,null,null,2,8,4,null,null,null,null,"8.","Olin",3,"8.","Tomáš",3,"8.","Červ",3,"8.","Hošan",3,"8.","Jozef",3]
[null,"22.","Melis",13,null,null,null,null,null,null,null,null,null,null,null,null,null,null,null,null,1,null,2,null,7,null,3,null,"9.","Jindra",2,"9.","Červ",2,"9.","Dan",2,"9.","Martin Ko",2,"9.","Martin Ko.",2]
[null,"23.","Jindra",12,null,2,null,4,2,4,null,null,null,null,null,null,null,null,null,null,null,null,null,null,null,null,null,null,"10.","Vláďa ",1,"10.","Luďa",1,"10.","Vláďa ",1,"10.","Marcel",1,"10.","Marcel",1]
[null,"24.","Toki",11,null,null,1,null,null,null,null,null,null,null,null,null,null,null,10]
[null,"25.","Vláďa",11,null,1,3,null,5,1,1,null,null,null,null,null,null,null,null,null,null,null,null,null,null,null,null,null,"LÉTO 2015",null,"b.","ZIMA 2015/2016",null,"b.","LÉTO 2016",null,"b.","ZIMA 2016/2017",null,"b.","LÉTO 2017",null,"b."]
[null,"26.","Červ",9,null,null,null,2,null,3,null,4,null,null,null,null,null,null,null,null,null,null,null,null,null,null,null,null,"1.","Kristalex",10,"1.","Míla",10,"1.","Kristalex",10,"1.","Hošan",10,"1.","Toki",10]
[null,"27.","Michal ",8,null,null,null,null,null,null,null,null,null,null,null,null,null,null,null,null,null,null,5,null,1,null,2,null,"2.","Marcel",9,"2.","Pája",9,"2.","Honza Č.",9,"2.","Marcel",9,"2.","Kristalex",9]
[null,"28.","Láďa",7,null,null,null,null,null,null,null,null,1,null,null,null,null,null,null,null,null,4,1,1,null,null,null,null,"3.","Dan",8,"3.","Dan",8,"3.","Marcel",8,"3.","Kristalex",8,"3.","Martin Ko.",8]
[null,"29.","Nowwas",7,null,null,null,null,null,null,null,null,null,null,1,6,null,null,null,null,null,null,null,null,null,null,null,null,"4.","Rosťa",7,"4.","Martin Ko.",7,"4.","Rosťa",7,"4.","Pája",7,"4.","Dan",7]
[null,"30.","Špágr",6,null,null,null,null,null,null,null,null,null,null,null,null,null,null,null,null,null,null,null,null,null,null,6,null,"5.","Ota",6,"5.","Nowwas",6,"5.","Pája",6,"5.","Dan",6,"5.","Černoch",6]
[null,"31.","Dočkil",5,3,null,2,null,null,null,null,null,null,null,null,null,null,null,null,null,null,null,null,null,null,null,null,null,"6.","Míla",5,"6.","Karel",5,"6.","Míla",5,"6.","Martin Ko.",5,"6.","Pája",5]
[null,"32.","Eman",5,null,null,null,null,null,null,null,null,null,null,null,null,null,null,null,null,null,null,null,null,null,null,5,null,"7.","Pája",4,"7.","Kristalex",4,"7.","Hošan",4,"7.","Karel",4,"7.","Míla",4]
[null,"33.","Jozef",5,null,null,null,null,null,null,null,null,null,3,2,null,null,null,null,null,null,null,null,null,null,null,null,null,"8.","Martin Ko.",3,"8.","Hošan",3,"8.","Martin Ko.",3,"8.","Námořník",3,"8.","Rosťa",3]
[null,"34.","Olin",5,2,3,null,null,null,null,null,null,null,null,null,null,null,null,null,null,null,null,null,null,null,null,null,null,"9.","Jozef",2,"9.","Marcel",2,"9.","Dan",2,"9.","Míla",2,"9.","Hošan",2]
[null,"35.","Trojin",5,null,null,null,null,null,null,null,null,null,null,null,null,null,null,null,null,null,null,null,null,5,null,null,null,"10.","Nowwas",1,"10.","Rosťa",1,"10.","Ota",1,"10.","Rosťa",1,"10.","Bóřa",1]
[null,"36.","Franta",4,4]
[null,"37.","Jarda",4,null,4,null,null,null,null,null,null,null,null,null,null,null,null,null,null,null,null,null,null,null,null,null,null,"ZIMA 2017/2018",null,"b.","LÉTO 2018",null,"b.","ZIMA 2018/2019",null,"b.","LÉTO 2019",null,"b.","ZIMA 2019/2020",null,"b."]
[null,"38.","Arpi",3,null,null,null,null,null,null,null,null,null,null,null,null,null,null,null,null,null,null,null,null,3,null,null,null,"1.","Kristalex",10,"1.","Pája",10,"1.","Kristalex",10,"1.","Kristalex",10,"1.","Kristalex",10]
[null,"39.","Ctibor",3,null,null,null,null,null,null,3,null,null,null,null,null,null,null,null,null,null,null,null,null,null,null,null,null,"2.","Pája",9,"2.","Kristalex",9,"2.","Pája",9,"2.","Rosťa",9,"2.","Pája",9]
[null,"40.","Čuďa",3,null,null,null,null,null,null,null,null,null,null,null,null,null,null,null,null,null,null,null,null,2,null,1,null,"3.","Dan",8,"3.","Hošan",8,"3.","Marek",8,"3.","Aleš",8,"3.","Láďa S.",8]
[null,"41.","Honza",3,null,null,null,null,null,null,null,null,null,null,null,null,null,null,null,null,null,null,3,null,null,null,null,null,"4.","Marcel",7,"4.","Marcel",7,"4.","Daniel",7,"4.","Pája",7,"4.","Venca",7]
[null,"42.","Jirka C.",3,null,null,null,null,null,null,null,null,null,null,null,null,null,null,null,null,null,3,null,null,null,null,null,null,"5.","Míla",6,"5.","Marek",6,"5.","Rosťa",6,"5.","Jirka",6,"5.","Daniel",6]
[null,"43.","Tomáš",3,null,null,null,3,null,null,null,null,null,null,null,null,null,null,null,null,null,null,null,null,null,null,null,null,"6.","Hošan",5,"6.","Venca",5,"6.","Venca",5,"6.","Michal",5,"6.","Jirka",5]
[null,"44.","Bazy",2,null,null,null,null,null,null,null,null,null,null,null,null,null,null,null,null,2,null,null,null,null,null,null,null,"7.","Karel",4,"7.","Míla",4,"7.","Láďa",4,"7.","Venca",4,"7.","Aleš",4]
[null,"45.","Bóřa",1,null,null,null,null,null,null,null,null,null,null,null,null,null,null,1,null,null,null,null,null,null,null,null,null,"8.","Martin Ko.",3,"8.","Daniel",3,"8.","Jirka",3,"8.","Honza",3,"8.","Rosťa",3]
[null,"46.","Jakub",1,null,null,null,null,null,null,null,null,null,null,null,null,null,null,null,null,null,1,null,null,null,null,null,null,"9.","Rosťa",2,"9.","Bazy",2,"9.","Aleš",2,"9.","Melis",2,"9.","Marek",2]
[null,"47.","Luďa",1,null,null,null,1,null,null,null,null,null,null,null,null,null,null,null,null,null,null,null,null,null,null,null,null,"10.","Černoch",1,"10.","Melis",1,"10.","Jakub",1,"10.","Láďa",1,"10.","Láďa",1]
[]
[null,null,null,null,null,null,null,null,null,null,null,null,null,null,null,null,null,null,null,null,null,null,null,null,null,null,null,null,"LÉTO 2020",null,"b.","ZIMA 2020/2021",null,null,"LÉTO 2021",null,"b."]
[null,null,null,null,null,null,null,null,null,null,null,null,null,null,null,null,null,null,null,null,null,null,null,null,null,null,null,null,"1.","Kristalex",10,"1.","COVID-19",null,"1.","Láďa S.",10]
[null,null,null,null,null,null,null,null,null,null,null,null,null,null,null,null,null,null,null,null,null,null,null,null,null,null,null,null,"2.","Pája",9,"2.",null,null,"2.","Pája",9]
[null,null,null,null,null,null,null,null,null,null,null,null,null,null,null,null,null,null,null,null,null,null,null,null,null,null,null,null,"3.","Láďa S.",8,"3.",null,null,"3.","Marek",8]
[null,null,null,null,null,null,null,null,null,null,null,null,null,null,null,null,null,null,null,null,null,null,null,null,null,null,null,null,"4.","Melis",7,"4.",null,null,"4.","Daniel",7]
[null,null,null,null,null,null,null,null,null,null,null,null,null,null,null,null,null,null,null,null,null,null,null,null,null,null,null,null,"5.","Marek",6,"5.",null,null,"5.","Špágr",6]
[null,null,null,null,null,null,null,null,null,null,null,null,null,null,null,null,null,null,null,null,null,null,null,null,null,null,null,null,"6.","Trojin",5,"6.",null,null,"6.","Eman",5]
[null,null,null,null,null,null,null,null,null,null,null,null,null,null,null,null,null,null,null,null,null,null,null,null,null,null,null,null,"7.","Daniel",4,"7.",null,null,"7.","Kristalex",4]
[null,null,null,null,null,null,null,null,null,null,null,null,null,null,null,null,null,null,null,null,null,null,null,null,null,null,null,null,"8.","Arpi",3,"8.",null,null,"8.","Melis",3]
[null,null,null,null,null,null,null,null,null,null,null,null,null,null,null,null,null,null,null,null,null,null,null,null,null,null,null,null,"9.","Čuďa",2,"9.",null,null,"9.","Michal",2]
[null,null,null,null,null,null,null,null,null,null,null,null,null,null,null,null,null,null,null,null,null,null,null,null,null,null,null,null,"10.","Michal",1,"10.",null,null,"10.","Čuďa",1]

{"sheet":"Aktuální TABULKA (2)","index":4,"n_rows":35,"n_cols":45,"rows_kept":35,"cut":false,"hidden":true,"merged":[[1,1,2,2],[29,1,29,2]]}
[" ",null,"kolo:",1,{"$f":"D1+1","v":2},{"$f":"E1+1","v":3},4,5,6,7,8,9,10,11,12,13,14,15,16,17,18,19,20,21,22,23,24,25,26,27,28,29,30]
[null,"ZIMA 2015/2016",null,{"$f":"IF(WEEKDAY(D3,2)=1,\"Po\",IF(WEEKDAY(D3,2)=2,\"Út\",IF(WEEKDAY(D3,2)=3,\"St\",IF(WEEKDAY(D3,2)=4,\"Čt\",IF(WEEKDAY(D3,2)=5,\"Pá\",IF(WEEKDAY(D3,2)=6,\"So\",\"NE\"))))))","v":"Pá"},{"$f":"IF(WEEKDAY(E3,2)=1,\"Po\",IF(WEEKDAY(E3,2)=2,\"Út\",IF(WEEKDAY(E3,2)=3,\"St\",IF(WEEKDAY(E3,2)=4,\"Čt\",IF(WEEKDAY(E3,2)=5,\"Pá\",IF(WEEKDAY(E3,2)=6,\"So\",\"NE\"))))))","v":"Pá"},"Pá","Pá","Pá","Pá","Pá","Pá","Pá","Pá","Pá","Pá","St","Pá","Pá","Pá","Pá","Pá","Pá","Pá","Pá","Pá","Pá","Pá","Pá","Pá","Pá","Čt","Pá","Pá"," ","hráno","nehráno"]
[null,null,null,"2015-10-02","2015-10-09","2015-10-16","2015-10-23","2015-10-30","2015-11-06","2015-11-13","2015-11-20","2015-11-27","2015-12-04","2015-12-11","2015-12-18","2014-12-31","2016-01-08","2016-01-15","2016-01-22","2016-01-29","2016-02-05","2016-02-12","2016-02-19","2016-02-26","2016-03-04","2016-03-11","2016-03-18","2016-03-25","2016-04-01","2016-04-08","2016-04-15","2016-04-22","2016-04-29"," ",{"$f":"COUNTA(D5:AG5)","v":1},0]
[]
[null,null,"platba","2",null,null,null,null,null,null,null,null,null,null,null,null,null,null,null,null,null,null,null,null,null,null,null,null,null,null,null,null,null,"BODY","minulé pořadí","POŘADÍ","Vývoj","HRÁČ","účasti","výhry","remízy","prohry","skóre","docházka","úspěšnost"]
[{"$f":"AJ6","v":1},"Marcel",null,3,null,null,null,null,null,null,null,null,null,null,null,null,null,null,null,null,null,null,null,null,null,null,null,null,null,null,null,null,null,{"$f":"SUM(D6:AG6)","v":3},1,1,{"$f":"AI6-AJ6","v":0},{"$f":"B6","v":"Marcel"},{"$f":"COUNT(D6:AG6)","v":1},1,0,0,2,{"$f":"+AM6/$AI$3","v":1},{"$f":"IF(AR6<0.5, \"n.a.\",(AN6+AO6/2)/AM6)","v":1}]
[2,"Míla",null,3,null,null,null,null,null,null,null,null,null,null,null,null,null,null,null,null,null,null,null,null,null,null,null,null,null,null,null,null,null,3,2,2,0,"Míla",1,1,0,0,2,1,1]
[3,"Martin Ko.",null,3,null,null,null,null,null,null,null,null,null,null,null,null,null,null,null,null,null,null,null,null,null,null,null,null,null,null,null,null,null,3,3,3,0,"Martin Ko.",1,1,0,0,2,1,1]
[4,"Dan",1000,3,null,null,null,null,null,null,null,null,null,null,null,null,null,null,null,null,null,null,null,null,null,null,null,null,null,null,null,null,null,3,4,4,0,"Dan",1,1,0,0,2,1,1]
[5,"Nowwas",null,1,null,null,null,null,null,null,null,null,null,null,null,null,null,null,null,null,null,null,null,null,null,null,null,null,null,null,null,null,null,1,5,5,0,"Nowwas",1,0,0,1,-2,1,0]
[6,"Námořník",null,1,null,null,null,null,null,null,null,null,null,null,null,null,null,null,null,null,null,null,null,null,null,null,null,null,null,null,null,null,null,1,6,6,0,"Námořník",1,0,0,1,-2,1,0]
[7,"Honza Č.",null,1,null,null,null,null,null,null,null,null,null,null,null,null,null,null,null,null,null,null,null,null,null,null,null,null,null,null,null,null,null,1,7,7,0,"Honza Č.",1,0,0,1,-2,1,0]
[8,"Pája",null,1,null,null,null,null,null,null,null,null,null,null,null,null,null,null,null,null,null,null,null,null,null,null,null,null,null,null,null,null,null,1,8,8,0,"Pája",1,0,0,1,-2,1,0]
[9,"Martin Kř.",null,1,null,null,null,null,null,null,null,null,null,null,null,null,null,null,null,null,null,null,null,null,null,null,null,null,null,null,null,null,null,1,9,9,0,"Martin Kř.",1,0,0,1,-2,1,0]
[10,"Karel",null,null,null,null,null,null,null,null,null,null,null,null,null,null,null,null,null,null,null,null,null,null,null,null,null,null,null,null,null,null,null,0,10,10,0,"Karel",0,0,0,0,0,0,"n.a."]
[11,"Martin H.",null,null,null,null,null,null,null,null,null,null,null,null,null,null,null,null,null,null,null,null,null,null,null,null,null,null,null,null,null,null,null,0,11,11,0,"Martin H.",0,0,0,0,0,0,"n.a."]
[12,"Jozef",null,null,null,null,null,null,null,null,null,null,null,null,null,null,null,null,null,null,null,null,null,null,null,null,null,null,null,null,null,null,null,0,12,12,0,"Jozef",0,0,0,0,0,0,"n.a."]
[13,"Rosťa",null,null,null,null,null,null,null,null,null,null,null,null,null,null,null,null,null,null,null,null,null,null,null,null,null,null,null,null,null,null,null,0,13,13,0,"Rosťa",0,0,0,0,0,0,"n.a."]
[14,"Láďa",null,null,null,null,null,null,null,null,null,null,null,null,null,null,null,null,null,null,null,null,null,null,null,null,null,null,null,null,null,null,null,0,14,14,0,"Láďa",0,0,0,0,0,0,"n.a."]
[15,"Červ",null,null,null,null,null,null,null,null,null,null,null,null,null,null,null,null,null,null,null,null,null,null,null,null,null,null,null,null,null,null,null,0,15,15,0,"Červ",0,0,0,0,0,0,"n.a."]
[16,"Kytka",null,null,null,null,null,null,null,null,null,null,null,null,null,null,null,null,null,null,null,null,null,null,null,null,null,null,null,null,null,null,null,0,16,16,0,"Kytka",0,0,0,0,0,0,"n.a."]
[17,"Vláďa ",null,null,null,null,null,null,null,null,null,null,null,null,null,null,null,null,null,null,null,null,null,null,null,null,null,null,null,null,null,null,null,0,17,17,0,"Vláďa ",0,0,0,0,0,0,"n.a."]
[18,"Dočkil",null,null,null,null,null,null,null,null,null,null,null,null,null,null,null,null,null,null,null,null,null,null,null,null,null,null,null,null,null,null,null,0,18,18,0,"Dočkil",0,0,0,0,0,0,"n.a."]
[{"$f":"AJ24","v":19},null,null,null,null,null,null,null,null,null,null,null,null,null,null,null,null,null,null,null,null,null,null,null,null,null,null,null,null,null,null,null,null,{"$f":"SUM(D24:X24)","v":0},19,19,{"$f":"AI24-AJ24","v":0},0,{"$f":"COUNT(D24:U24)","v":0},0,0,0,0,{"$f":"+AM24/$AI$3","v":0},{"$f":"IF(AR24<0.5, \"n.a.\",(AN24+AO24/2)/AM24)","v":"n.a."}]
[20,null,null,null,null,null,null,null,null,null,null,null,null,null,null,null,null,null,null,null,null,null,null,null,null,null,null,null,null,null,null,null,null,0,20,20,0,0,0,0,0,0,0,0,"n.a."]
[21,null,null,null,null,null,null,null,null,null,null,null,null,null,null,null,null,null,null,null,null,null,null,null,null,null,null,null,null,null,null,null,null,0,21,21,0,0,0,0,0,0,0,0,"n.a."]
[22,null,null,null,null,null,null,null,null,null,null,null,null,null,null,null,null,null,null,null,null,null,null,null,null,null,null,null,null,null,null,null,null,0,22,22,0,0,0,0,0,0,0,0,"n.a."]
[23,null,null,null,null,null,null,null,null,null,null,null,null,null,null,null,null,null,null,null,null,null,null,null,null,null,null,null,null,null,null,null,null,0,23,23,0,0,0,0,0,0,0,0,"n.a."]
[24,null,null,null,null,null,null,null,null,null,null,null,null,null,null,null,null,null,null,null,null,null,null,null,null,null,null,null,null,null,null,null,null,0,24,24,0,0,0,0,0,0,0,0,"n.a."]
[null,"počet hráčů:",null,{"$f":"IF(COUNT(D6:D29) = 0, \"n/a\", COUNT(D6:D29))","v":9},{"$f":"IF(COUNT(E6:E29) = 0, \"n/a\", COUNT(E6:E29))","v":"n/a"},"n/a","n/a","n/a","n/a","n/a","n/a","n/a","n/a","n/a","n/a","n/a","n/a","n/a","n/a","n/a","n/a","n/a","n/a","n/a","n/a","n/a","n/a","n/a","n/a","n/a","n/a","n/a","n/a",{"$f":"AVERAGE(D30:E30)","v":9}]
[]
[null,"výhra",3,null,null,null,null,null,null,null,null,null,null,null,null,null,null,null,null,null,null,null,null,null,null,null,null,null,null,null,null,null,null," - při rovnosti bodů rozhoduje o pořadí vyšší počet účastí, potom skóre, úspěšnost, los "]
[null,"remíza",2,null,null,null,null,null,null,null,null,null,null,null,null,null,null,null,null,null,null,null,null,null,null,null,null,null,null,null,null,null,null," - procento úspěšnosti se počítá pouze u hráčů s minimálně 50% docházkou "]
[null,"prohra",1,null,null,null,null,null,null,null,null,null,null,null,null,null,null,null,null,null,null,null,null,null,null,null,null,null,null,null,null,null,null," - v posledním \"double\" kole se všechny položky počítají dvojnásobně; rozdělení sudá / lichá"]
[null,"neúčast",0," ",null,null,null,null,null,null,null,null,null,null,null,null,null,null,null,null,null,null,null,null,null,null,null,null,null,null,null,null,null," - v prvních kolech sezóny se při shodném počtu bodů určuje pořadí podle posl. sezóny téhož období"]